Target
Intestinal-type alkaline phosphatase
Ligand
BDBM75635
Substrate
Meas. Tech.
Dose Response concentration confirmation of uHTS hits from a small molecule activators of human intestinal alkaline phosphatase via a luminescent assay
EC50
15800±n/a nM
Citation
 PubChem, PC Dose Response concentration confirmation of uHTS hits from a small molecule activators of human intestinal alkaline phosphatase via a luminescent assay PubChem Bioassay (2010)[AID] 
Target
Name:
Intestinal-type alkaline phosphatase
Synonyms:
ALPI Intestinal alkaline phosphatase | PPBI_HUMAN
Type:
PROTEIN
Mol. Mass.:
56804.94
Organism:
Homo sapiens (Human)
Description:
ChEMBL_1278525
Residue:
528
  
Inhibitor
Name:
BDBM75635
Synonyms:
2-[[2-(2-fluoroanilino)-2-keto-ethyl]-methyl-amino]-N-(2,3,4-trifluorophenyl)acetamide 2-[[2-[(2-fluorophenyl)amino]-2-oxidanylidene-ethyl]-methyl-amino]-N-[2,3,4-tris(fluoranyl)phenyl]ethanamide SMR000353000 | cid_2118581
Type:
Small organic molecule
Emp. Form.:
C17H15F4N3O2
Mol. Mass.:
369.3135
SMILES:
CN(CC(=O)Nc1ccccc1F)CC(=O)Nc1ccc(F)c(F)c1F
: