Target
Intestinal-type alkaline phosphatase
Ligand
BDBM75650
Substrate
Meas. Tech.
Dose Response concentration confirmation of uHTS hits from a small molecule activators of human intestinal alkaline phosphatase via a luminescent assay
EC50
>100000±n/a nM
Citation
 PubChem, PC Dose Response concentration confirmation of uHTS hits from a small molecule activators of human intestinal alkaline phosphatase via a luminescent assay PubChem Bioassay (2010)[AID] 
Target
Name:
Intestinal-type alkaline phosphatase
Synonyms:
ALPI Intestinal alkaline phosphatase | PPBI_HUMAN
Type:
PROTEIN
Mol. Mass.:
56804.94
Organism:
Homo sapiens (Human)
Description:
ChEMBL_1278525
Residue:
528
  
Inhibitor
Name:
BDBM75650
Synonyms:
MLS001209276 N-[(3,4,5-trimethoxyphenyl)methylideneamino]benzenesulfonamide The compound has not trivial name. | cid_1114608
Type:
Small organic molecule
Emp. Form.:
C16H18N2O5S
Mol. Mass.:
350.39
SMILES:
COc1cc(C=NNS(=O)(=O)c2ccccc2)cc(OC)c1OC
: