Target
Intestinal-type alkaline phosphatase
Ligand
BDBM75678
Substrate
Meas. Tech.
Dose Response concentration confirmation of uHTS hits from a small molecule activators of human intestinal alkaline phosphatase via a luminescent assay
EC50
>100000±n/a nM
Citation
 PubChem, PC Dose Response concentration confirmation of uHTS hits from a small molecule activators of human intestinal alkaline phosphatase via a luminescent assay PubChem Bioassay (2010)[AID] 
Target
Name:
Intestinal-type alkaline phosphatase
Synonyms:
ALPI Intestinal alkaline phosphatase | PPBI_HUMAN
Type:
PROTEIN
Mol. Mass.:
56804.94
Organism:
Homo sapiens (Human)
Description:
ChEMBL_1278525
Residue:
528
  
Inhibitor
Name:
BDBM75678
Synonyms:
2-(4-bromanylphenoxy)-N-(3-imidazol-1-ylpropyl)ethanamide 2-(4-bromophenoxy)-N-[3-(1-imidazolyl)propyl]acetamide SMR000647052 | cid_4351260
Type:
Small organic molecule
Emp. Form.:
C14H16BrN3O2
Mol. Mass.:
338.2
SMILES:
Brc1ccc(OCC(=O)NCCCn2ccnc2)cc1
: