Target
Intestinal-type alkaline phosphatase
Ligand
BDBM43817
Substrate
Meas. Tech.
Dose Response concentration confirmation of uHTS hits from a small molecule activators of human intestinal alkaline phosphatase via a luminescent assay
EC50
8620±n/a nM
Citation
 PubChem, PC Dose Response concentration confirmation of uHTS hits from a small molecule activators of human intestinal alkaline phosphatase via a luminescent assay PubChem Bioassay (2010)[AID] 
Target
Name:
Intestinal-type alkaline phosphatase
Synonyms:
ALPI Intestinal alkaline phosphatase | PPBI_HUMAN
Type:
PROTEIN
Mol. Mass.:
56804.94
Organism:
Homo sapiens (Human)
Description:
ChEMBL_1278525
Residue:
528
  
Inhibitor
Name:
BDBM43817
Synonyms:
(3Z)-1-allyl-3-[(2-hydroxyphenyl)hydrazono]oxindole (3Z)-3-[(2-hydroxyphenyl)hydrazinylidene]-1-prop-2-enyl-indol-2-one ML087 cid_25199559
Type:
Small organic molecule
Emp. Form.:
C17H15N3O2
Mol. Mass.:
293.3199
SMILES:
Oc1ccccc1NN=C1C(=O)N(CC=C)c2ccccc12
: