Target
Intestinal-type alkaline phosphatase
Ligand
BDBM75706
Substrate
Meas. Tech.
Dose Response concentration confirmation of uHTS hits from a small molecule activators of human intestinal alkaline phosphatase via a luminescent assay
EC50
11800±n/a nM
Citation
 PubChem, PC Dose Response concentration confirmation of uHTS hits from a small molecule activators of human intestinal alkaline phosphatase via a luminescent assay PubChem Bioassay (2010)[AID] 
Target
Name:
Intestinal-type alkaline phosphatase
Synonyms:
ALPI Intestinal alkaline phosphatase | PPBI_HUMAN
Type:
PROTEIN
Mol. Mass.:
56804.94
Organism:
Homo sapiens (Human)
Description:
ChEMBL_1278525
Residue:
528
  
Inhibitor
Name:
BDBM75706
Synonyms:
MLS002248235 N'-(3,5-dimethoxybenzoyl)-4-keto-3-methyl-phthalazine-1-carbohydrazide N'-[(3,5-dimethoxyphenyl)-oxomethyl]-3-methyl-4-oxo-1-phthalazinecarbohydrazide cid_2520356
Type:
Small organic molecule
Emp. Form.:
C19H18N4O5
Mol. Mass.:
382.37
SMILES:
COc1cc(OC)cc(c1)C(=O)NNC(=O)c1nn(C)c(=O)c2ccccc12
: