Target
Beta-secretase 1
Ligand
BDBM269488
Substrate
Meas. Tech.
BACE1 Binding Assay
pH
4.5±n/a
Temperature
298.15±n/a K
Ki
25.0±n/a nM
Comments
extracted
Citation
 Juhl, KTagmose, LMarigo, M 2-amino-5,5-difluoro-6-(fluoromethyl)-6-phenyl-3,4,5,6-tetrahydropyridines as BACE1 inhibitors US Patent  US10058540 Publication Date 8/28/2018 
Target
Name:
Beta-secretase 1
Synonyms:
ASP2 Aspartyl protease 2 BACE1 Beta-secretase (BACE) Beta-secretase 1 (BACE 1) Beta-secretase 1 (BACE1) Beta-site amyloid precursor protein cleaving enzyme 1 Memapsin-2 beta-Secretase (BACE-1) | beta-Secretase (BACE1)
Type:
Protein
Mol. Mass.:
55755.10
Organism:
Homo sapiens (Human)
Description:
P56817
Residue:
501
  
Inhibitor
Name:
BDBM269488
Synonyms:
(S)-N-(3-(6-amino-3,3-difluoro-2-(fluoromethyl)-2,3,4,5-tetrahydropyridin-2-yl)-4-fluorophenyl)-1-(difluoromethyl)-1H-pyrazole-3-carboxamide | US10058540, 4
Type:
Small organic molecule
Emp. Form.:
C17H15F6N5O
Mol. Mass.:
419.3243
SMILES:
NC1=N[C@](CF)(c2cc(NC(=O)c3ccn(n3)C(F)F)ccc2F)C(F)(F)CC1
: