Target
Sphingosine 1-phosphate receptor 2
Ligand
BDBM47493
Substrate
Meas. Tech.
Late-stage fluorescence-based dose-response cell-based assay to identify agonists of the Sphingosine 1-Phosphate Receptor 4 (S1P4): Sphingosine 1-Phosphate Receptor 2 (S1P2) counterscreen assay
EC50
>50000±n/a nM
Citation
 PubChem, PC Late-stage fluorescence-based dose-response cell-based assay to identify agonists of the Sphingosine 1-Phosphate Receptor 4 (S1P4): Sphingosine 1-Phosphate Receptor 2 (S1P2) counterscreen assay PubChem Bioassay (2010)[AID] 
Target
Name:
Sphingosine 1-phosphate receptor 2
Synonyms:
EDG5 S1PR2 Sphingosine 1-phosphate receptor Sphingosine-1-phosphate receptor 2 | ndothelial differentiation G-protein coupled receptor 5
Type:
G Protein-Coupled Receptor (GPCR)
Mol. Mass.:
38883.16
Organism:
Homo sapiens (Human)
Description:
Membranes isolated from S1P2-transfected CHO cells were used in ligand binding assay.
Residue:
353
  
Inhibitor
Name:
BDBM47493
Synonyms:
3-[2-(2,4-dichlorophenoxy)ethoxy]-6-methyl-2-nitro-pyridine 3-[2-[2,4-bis(chloranyl)phenoxy]ethoxy]-6-methyl-2-nitro-pyridine SMR000264378 | cid_4780551
Type:
Small organic molecule
Emp. Form.:
C14H12Cl2N2O4
Mol. Mass.:
343.162
SMILES:
Cc1ccc(OCCOc2ccc(Cl)cc2Cl)c(n1)[N+]([O-])=O
: