Target
Sphingosine 1-phosphate receptor 3
Ligand
BDBM75602
Substrate
Meas. Tech.
Late-stage fluorescence-based dose-response cell-based assay to identify agonists of the Sphingosine 1-Phosphate Receptor 4 (S1P4): Sphingosine 1-Phosphate Receptor 3 (S1P3) counterscreen assay
EC50
>50000±n/a nM
Citation
 PubChem, PC Late-stage fluorescence-based dose-response cell-based assay to identify agonists of the Sphingosine 1-Phosphate Receptor 4 (S1P4): Sphingosine 1-Phosphate Receptor 3 (S1P3) counterscreen assay PubChem Bioassay (2010)[AID] 
Target
Name:
Sphingosine 1-phosphate receptor 3
Synonyms:
C9orf108 EDG3 S1P receptor 3 S1P3 S1PR3_HUMAN Sphingosine 1-phosphate receptor 3 (S1P3) | Sphingosine 1-phosphate receptor Edg-3
Type:
G Protein-Coupled Receptor (GPCR)
Mol. Mass.:
42278.13
Organism:
Homo sapiens (Human)
Description:
Q99500
Residue:
378
  
Inhibitor
Name:
BDBM75602
Synonyms:
2,6-dibromo-3-[2-(2,4-dichlorophenoxy)ethoxy]pyridine CYM50179 SR-02000000304 cid_44620892
Type:
Small organic molecule
Emp. Form.:
C13H9Br2Cl2NO2
Mol. Mass.:
441.93
SMILES:
Clc1ccc(OCCOc2ccc(Br)nc2Br)c(Cl)c1
: