Target
Sphingosine 1-phosphate receptor 3
Ligand
BDBM75603
Substrate
Meas. Tech.
Late-stage fluorescence-based dose-response cell-based assay to identify agonists of the Sphingosine 1-Phosphate Receptor 4 (S1P4): Sphingosine 1-Phosphate Receptor 3 (S1P3) counterscreen assay
EC50
>50000±n/a nM
Citation
 PubChem, PC Late-stage fluorescence-based dose-response cell-based assay to identify agonists of the Sphingosine 1-Phosphate Receptor 4 (S1P4): Sphingosine 1-Phosphate Receptor 3 (S1P3) counterscreen assay PubChem Bioassay (2010)[AID] 
Target
Name:
Sphingosine 1-phosphate receptor 3
Synonyms:
C9orf108 EDG3 S1P receptor 3 S1P3 S1PR3_HUMAN Sphingosine 1-phosphate receptor 3 (S1P3) | Sphingosine 1-phosphate receptor Edg-3
Type:
G Protein-Coupled Receptor (GPCR)
Mol. Mass.:
42278.13
Organism:
Homo sapiens (Human)
Description:
Q99500
Residue:
378
  
Inhibitor
Name:
BDBM75603
Synonyms:
(5Z)-5-[[1-(2,6-difluorobenzyl)-2,5-dimethyl-pyrrol-3-yl]methylene]-3-methoxy-2-methylimino-thiazolidin-4-one (5Z)-5-[[1-[(2,6-difluorophenyl)methyl]-2,5-dimethylpyrrol-3-yl]methylidene]-3-methoxy-2-methylimino-1,3-thiazolidin-4-one CYM50181 SR-02000000305-1 | cid_44620879
Type:
Small organic molecule
Emp. Form.:
C19H19F2N3O2S
Mol. Mass.:
391.435
SMILES:
CON1C(=O)\C(S\C1=N/C)=C\c1cc(C)n(Cc2c(F)cccc2F)c1C
: