Target
Oxytocin receptor
Ligand
BDBM66022
Substrate
Meas. Tech.
Counterscreen for vasopressin 1 receptor (V1R) agonists: Fluorescence-based cell-based high throughput dose response assay for agonists of the Oxytocin Receptor (OXTR)
EC50
>29916±n/a nM
Citation
 PubChem, PC Counterscreen for vasopressin 1 receptor (V1R) agonists: Fluorescence-based cell-based high throughput dose response assay for agonists of the Oxytocin Receptor (OXTR) PubChem Bioassay (2010)[AID] 
Target
Name:
Oxytocin receptor
Synonyms:
OT-R OXYR_HUMAN | Oxytocin
Type:
Enzyme Catalytic Domain
Mol. Mass.:
42793.26
Organism:
Homo sapiens (Human)
Description:
Oxytocin OXTR HEK293::B2R9L7
Residue:
389
  
Inhibitor
Name:
BDBM66022
Synonyms:
KE-IK SMR001231046 | cid_25163004
Type:
Small organic molecule
Emp. Form.:
C67H116N18O9
Mol. Mass.:
1317.7531
SMILES:
CC[C@H](C)Cc1cn(nn1)[C@@H](CCCCN)C(=O)NCCCCCCCCCCC(=O)N1CCN(CC1)c1nc(NCCOCCOCCOCC#C)nc(n1)N1CCN(CC1)C(=O)CCCCCCCCCCNC(=O)[C@@H](CCC(O)=O)n1cc(CCCCCN)nn1
: