Target
Intestinal-type alkaline phosphatase
Ligand
BDBM75725
Substrate
Meas. Tech.
Dose Response confirmation of uHTS hits from a small molecule inhibitors of human intestinal alkaline phosphatase via a luminescent assay
IC50
>100000±n/a nM
Citation
 PubChem, PC Dose Response confirmation of uHTS hits from a small molecule inhibitors of human intestinal alkaline phosphatase via a luminescent assay PubChem Bioassay (2010)[AID] 
Target
Name:
Intestinal-type alkaline phosphatase
Synonyms:
ALPI Intestinal alkaline phosphatase | PPBI_HUMAN
Type:
PROTEIN
Mol. Mass.:
56804.94
Organism:
Homo sapiens (Human)
Description:
ChEMBL_1278525
Residue:
528
  
Inhibitor
Name:
BDBM75725
Synonyms:
8-[(5-phenyl-1,3,4-oxadiazol-2-yl)methyl]-1,4-dioxa-8-azaspiro[4.5]decane SMR000082017 | cid_1631759
Type:
Small organic molecule
Emp. Form.:
C16H19N3O3
Mol. Mass.:
301.3404
SMILES:
C(N1CCC2(CC1)OCCO2)c1nnc(o1)-c1ccccc1
: