Target
Furin
Ligand
BDBM74846
Substrate
Meas. Tech.
High throughput fluorescence intensity-based biochemical assay to screen for small molecule inhibitors of Furin:Concentration-response Confirmation Assays
IC50
>50000±n/a nM
Citation
 PubChem, PC High throughput fluorescence intensity-based biochemical assay to screen for small molecule inhibitors of Furin:Concentration-response Confirmation Assays PubChem Bioassay (2010)[AID] 
Target
Name:
Furin
Synonyms:
FUR FURIN_HUMAN PACE | PCSK3
Type:
Enzyme Catalytic Domain
Mol. Mass.:
86676.01
Organism:
Homo sapiens (Human)
Description:
P09958
Residue:
794
  
Inhibitor
Name:
BDBM74846
Synonyms:
(5Z)-1-(3-methylphenyl)-5-[(E)-3-phenylazanylprop-2-enylidene]-1,3-diazinane-2,4,6-trione (5Z)-5-[(E)-3-anilinoprop-2-enylidene]-1-(m-tolyl)barbituric acid MLS000587895 cid_6862860
Type:
Small organic molecule
Emp. Form.:
C20H17N3O3
Mol. Mass.:
347.3673
SMILES:
Cc1cccc(c1)-n1c(O)c(C=CC=Nc2ccccc2)c(=O)[nH]c1=O
: