Target
Type-1 angiotensin II receptor
Ligand
BDBM59072
Substrate
Meas. Tech.
Dose Response screen for antagonists of Angiotensin II Receptor Type 1 to assess selectivity of uHTS small molecule antagonists hits of the APJ receptor
IC50
2181±220 nM
Citation
 PubChem, PC Dose Response screen for antagonists of Angiotensin II Receptor Type 1 to assess selectivity of uHTS small molecule antagonists hits of the APJ receptor PubChem Bioassay (2010)[AID] 
Target
Name:
Type-1 angiotensin II receptor
Synonyms:
AGTR1 AGTR1B AT1 AT1BR AT2R1B Angiotensin II receptor Type-1 angiotensin II receptor (AT1)
Type:
Protein
Mol. Mass.:
41080.75
Organism:
Homo sapiens (Human)
Description:
P30556
Residue:
359
  
Inhibitor
Name:
BDBM59072
Synonyms:
5-chloranyl-2-ethylsulfonyl-N-[4-(3-methylpiperidin-1-yl)sulfonylphenyl]pyrimidine-4-carboxamide 5-chloro-2-ethylsulfonyl-N-[4-(3-methylpiperidin-1-yl)sulfonylphenyl]pyrimidine-4-carboxamide MLS001116387 cid_16436605
Type:
Small organic molecule
Emp. Form.:
C19H23ClN4O5S2
Mol. Mass.:
486.993
SMILES:
CCS(=O)(=O)c1ncc(Cl)c(n1)C(=O)Nc1ccc(cc1)S(=O)(=O)N1CCCC(C)C1
: