Target
G-protein coupled receptor 35
Ligand
BDBM61153
Substrate
Meas. Tech.
SAR Analysis for the identification of Selective Antagonists of ERK1/2 Activity in GPR35-Overexpressing U2OS Cells
IC50
1393±328 nM
Citation
 PubChem, PC SAR Analysis for the identification of Selective Antagonists of ERK1/2 Activity in GPR35-Overexpressing U2OS Cells PubChem Bioassay (2010)[AID] 
Target
Name:
G-protein coupled receptor 35
Synonyms:
G protein-coupled receptor 35 GPR35_HUMAN
Type:
Enzyme Catalytic Domain
Mol. Mass.:
34085.57
Organism:
Homo sapiens (Human)
Description:
gi_33695097
Residue:
309
  
Inhibitor
Name:
BDBM61153
Synonyms:
3-[4-[(5Z)-4-keto-5-(4-methylbenzylidene)-2-thioxo-thiazolidin-3-yl]butanoylamino]benzoic acid 3-[4-[(5Z)-5-[(4-methylphenyl)methylidene]-4-oxo-2-sulfanylidene-1,3-thiazolidin-3-yl]butanoylamino]benzoic acid MLS001034563 cid_1346721
Type:
Small organic molecule
Emp. Form.:
C22H20N2O4S2
Mol. Mass.:
440.535
SMILES:
Cc1ccc(\C=C2/SC(=S)N(CCCC(=O)Nc3cccc(c3)C(O)=O)C2=O)cc1
: