Target
G-protein coupled receptor 35
Ligand
BDBM64826
Substrate
Meas. Tech.
SAR Analysis for the identification of Selective Antagonists of ERK1/2 Activity in GPR35-Overexpressing U2OS Cells
IC50
>32000±191 nM
Citation
 PubChem, PC SAR Analysis for the identification of Selective Antagonists of ERK1/2 Activity in GPR35-Overexpressing U2OS Cells PubChem Bioassay (2010)[AID] 
Target
Name:
G-protein coupled receptor 35
Synonyms:
G protein-coupled receptor 35 GPR35_HUMAN
Type:
Enzyme Catalytic Domain
Mol. Mass.:
34085.57
Organism:
Homo sapiens (Human)
Description:
gi_33695097
Residue:
309
  
Inhibitor
Name:
BDBM64826
Synonyms:
MLS-0304362.0001 N-(4-hydroxyphenyl)-4-[(5Z)-5-[(4-methoxyphenyl)methylidene]-4-oxidanylidene-2-sulfanylidene-1,3-thiazolidin-3-yl]butanamide N-(4-hydroxyphenyl)-4-[(5Z)-5-[(4-methoxyphenyl)methylidene]-4-oxo-2-sulfanylidene-3-thiazolidinyl]butanamide | cid_1356907
Type:
Small organic molecule
Emp. Form.:
C21H20N2O4S2
Mol. Mass.:
428.524
SMILES:
COc1ccc(\C=C2/SC(=S)N(CCCC(=O)Nc3ccc(O)cc3)C2=O)cc1
: