Target
Insulin-degrading enzyme
Ligand
BDBM75793
Substrate
Meas. Tech.
Dose Response: Fluorescence polarization-based cell-based high throughput dose response assay for inhibitors of insulin-degrading enzyme (IDE)
IC50
21166±n/a nM
Citation
 PubChem, PC Dose Response: Fluorescence polarization-based cell-based high throughput dose response assay for inhibitors of insulin-degrading enzyme (IDE) PubChem Bioassay (2010)[AID] 
Target
Name:
Insulin-degrading enzyme
Synonyms:
Abeta-degrading protease IDE Insulin degrading enzyme (hIDE) Insulin-degrading enzyme Insulysin | insulin-degrading enzyme isoform 1 precursor
Type:
Enzyme Catalytic Domain
Mol. Mass.:
117968.59
Organism:
Homo sapiens (Human)
Description:
P14735
Residue:
1019
  
Inhibitor
Name:
BDBM75793
Synonyms:
2-furfuryl-(8-methoxy-5H-pyrimid[5,4-b]indol-4-yl)amine MLS000558529 N-(furan-2-ylmethyl)-8-methoxy-5H-pyrimido[5,4-b]indol-4-amine cid_942803
Type:
Small organic molecule
Emp. Form.:
C16H14N4O2
Mol. Mass.:
294.308
SMILES:
COc1ccc2[nH]c3c(NCc4ccco4)ncnc3c2c1
: