Target
Insulin-degrading enzyme
Ligand
BDBM75802
Substrate
Meas. Tech.
Dose Response: Fluorescence polarization-based cell-based high throughput dose response assay for inhibitors of insulin-degrading enzyme (IDE)
IC50
>55929±n/a nM
Citation
 PubChem, PC Dose Response: Fluorescence polarization-based cell-based high throughput dose response assay for inhibitors of insulin-degrading enzyme (IDE) PubChem Bioassay (2010)[AID] 
Target
Name:
Insulin-degrading enzyme
Synonyms:
Abeta-degrading protease IDE Insulin degrading enzyme (hIDE) Insulin-degrading enzyme Insulysin | insulin-degrading enzyme isoform 1 precursor
Type:
Enzyme Catalytic Domain
Mol. Mass.:
117968.59
Organism:
Homo sapiens (Human)
Description:
P14735
Residue:
1019
  
Inhibitor
Name:
BDBM75802
Synonyms:
(3-Amino-6-phenyl-thieno[2,3-b]pyridin-2-yl)-(4-methoxy-phenyl)-methanone (3-amino-6-phenyl-thieno[2,3-b]pyridin-2-yl)-(4-methoxyphenyl)methanone (3-azanyl-6-phenyl-thieno[2,3-b]pyridin-2-yl)-(4-methoxyphenyl)methanone SMR000211467 | cid_1215664
Type:
Small organic molecule
Emp. Form.:
C21H16N2O2S
Mol. Mass.:
360.429
SMILES:
COc1ccc(cc1)C(=O)c1sc2nc(ccc2c1N)-c1ccccc1
: