Target
Insulin-degrading enzyme
Ligand
BDBM75820
Substrate
Meas. Tech.
Dose Response: Fluorescence polarization-based cell-based high throughput dose response assay for inhibitors of insulin-degrading enzyme (IDE)
IC50
8834±n/a nM
Citation
 PubChem, PC Dose Response: Fluorescence polarization-based cell-based high throughput dose response assay for inhibitors of insulin-degrading enzyme (IDE) PubChem Bioassay (2010)[AID] 
Target
Name:
Insulin-degrading enzyme
Synonyms:
Abeta-degrading protease IDE Insulin degrading enzyme (hIDE) Insulin-degrading enzyme Insulysin | insulin-degrading enzyme isoform 1 precursor
Type:
Enzyme Catalytic Domain
Mol. Mass.:
117968.59
Organism:
Homo sapiens (Human)
Description:
P14735
Residue:
1019
  
Inhibitor
Name:
BDBM75820
Synonyms:
3-[(2E)-2-(3-ethyl-1,3-benzothiazol-2(3H)-ylidene)ethylidene]pentane-2,4-dione MLS000724101 cid_16193234
Type:
Small organic molecule
Emp. Form.:
C16H17NO2S
Mol. Mass.:
287.377
SMILES:
[#6]-[#6]-[#7]-1-[#6](-[#16]-c2ccccc-12)=[#6]\[#6]=[#6](\[#6](-[#6])=O)-[#6](-[#6])=O
: