Target
Insulin-degrading enzyme
Ligand
BDBM52848
Substrate
Meas. Tech.
Dose Response: Fluorescence polarization-based cell-based high throughput dose response assay for inhibitors of insulin-degrading enzyme (IDE)
IC50
>55934±n/a nM
Citation
 PubChem, PC Dose Response: Fluorescence polarization-based cell-based high throughput dose response assay for inhibitors of insulin-degrading enzyme (IDE) PubChem Bioassay (2010)[AID] 
Target
Name:
Insulin-degrading enzyme
Synonyms:
Abeta-degrading protease IDE Insulin degrading enzyme (hIDE) Insulin-degrading enzyme Insulysin | insulin-degrading enzyme isoform 1 precursor
Type:
Enzyme Catalytic Domain
Mol. Mass.:
117968.59
Organism:
Homo sapiens (Human)
Description:
P14735
Residue:
1019
  
Inhibitor
Name:
BDBM52848
Synonyms:
MLS000333673 SMR000437879 [(2Z)-3-oxo-2-[(2,4,5-trimethoxyphenyl)methylidene]-1-benzofuran-6-yl] methanesulfonate methanesulfonic acid [(2Z)-3-keto-2-(2,4,5-trimethoxybenzylidene)coumaran-6-yl] ester | methanesulfonic acid [(2Z)-3-oxo-2-[(2,4,5-trimethoxyphenyl)methylidene]-6-benzofuranyl] ester
Type:
Small organic molecule
Emp. Form.:
C19H18O8S
Mol. Mass.:
406.406
SMILES:
COc1cc(OC)c(\C=C2/Oc3cc(OS(C)(=O)=O)ccc3C2=O)cc1OC
: