Target
Insulin-degrading enzyme
Ligand
BDBM75837
Substrate
Meas. Tech.
Dose Response: Fluorescence polarization-based cell-based high throughput dose response assay for inhibitors of insulin-degrading enzyme (IDE)
IC50
31557±n/a nM
Citation
 PubChem, PC Dose Response: Fluorescence polarization-based cell-based high throughput dose response assay for inhibitors of insulin-degrading enzyme (IDE) PubChem Bioassay (2010)[AID] 
Target
Name:
Insulin-degrading enzyme
Synonyms:
Abeta-degrading protease IDE Insulin degrading enzyme (hIDE) Insulin-degrading enzyme Insulysin | insulin-degrading enzyme isoform 1 precursor
Type:
Enzyme Catalytic Domain
Mol. Mass.:
117968.59
Organism:
Homo sapiens (Human)
Description:
P14735
Residue:
1019
  
Inhibitor
Name:
BDBM75837
Synonyms:
MLS000860928 [4-(7-chloranylquinolin-4-yl)piperazin-1-yl]-cyclobutyl-methanone [4-(7-chloro-4-quinolyl)piperazino]-cyclobutyl-methanone [4-(7-chloroquinolin-4-yl)piperazino](cyclobutyl)methanone | cid_2823686
Type:
Small organic molecule
Emp. Form.:
C18H20ClN3O
Mol. Mass.:
329.824
SMILES:
Clc1ccc2c(ccnc2c1)N1CCN(CC1)C(=O)C1CCC1
: