Target
Sphingosine 1-phosphate receptor 4
Ligand
BDBM75602
Substrate
Meas. Tech.
Late-stage fluorescence dose response cell-based counterscreening assay for antagonists of the Sphingosine 1-Phosphate Receptor 4 (S1P4): inhibition by S1P4-selective antagonist
IC50
830±n/a nM
Citation
 PubChem, PC Late-stage fluorescence dose response cell-based counterscreening assay for antagonists of the Sphingosine 1-Phosphate Receptor 4 (S1P4): inhibition by S1P4-selective antagonist PubChem Bioassay (2010)[AID] 
Target
Name:
Sphingosine 1-phosphate receptor 4
Synonyms:
EDG6 S1P receptor 4 S1P4 S1PR4_HUMAN Sphingosine 1-phosphate receptor Edg-6 sphingosine-1-phosphate 4 S1P4
Type:
G Protein-Coupled Receptor (GPCR)
Mol. Mass.:
41647.39
Organism:
Homo sapiens (Human)
Description:
Residue:
384
  
Inhibitor
Name:
BDBM75602
Synonyms:
2,6-dibromo-3-[2-(2,4-dichlorophenoxy)ethoxy]pyridine CYM50179 SR-02000000304 cid_44620892
Type:
Small organic molecule
Emp. Form.:
C13H9Br2Cl2NO2
Mol. Mass.:
441.93
SMILES:
Clc1ccc(OCCOc2ccc(Br)nc2Br)c(Cl)c1
: