Target
Melanin-concentrating hormone receptor 1
Ligand
BDBM75936
Substrate
Meas. Tech.
Late-stage fluorescence-based counterscreen for antagonists of the G-protein coupled receptor 7 (GPR7)
IC50
3500±n/a nM
Citation
 PubChem, PC Late-stage fluorescence-based counterscreen for antagonists of the G-protein coupled receptor 7 (GPR7): cell-based dose response assay to identify antagonists of the melanin-concentrating hormone receptor 1 (MCHR1) PubChem Bioassay (2010)[AID] 
Target
Name:
Melanin-concentrating hormone receptor 1
Synonyms:
G-protein coupled receptor 24 MCH receptor 1 MCH-R1 MCHR-1 MCHR1_HUMAN Melanin-Concentrating Hormone Receptor 1 (MCH1R) Melanin-concentrating hormone receptor 1 (MCH-1) Melanin-concentrating hormone receptor 1 (MCHR-1) SLC-1 Somatostatin receptor-like protein
Type:
G Protein-Coupled Receptor (GPCR)
Mol. Mass.:
45976.27
Organism:
Homo sapiens (Human)
Description:
Membranes from CHO-K1 cells stably expressing human MCH1R were used in assays.
Residue:
422
  
Inhibitor
Name:
BDBM75936
Synonyms:
SR-02000000472 [4-[5-chloranyl-3-oxidanylidene-2-(4-propan-2-ylphenyl)pyridazin-4-yl]oxyphenyl]methyl ethanoate acetic acid [4-(5-chloro-3-keto-2-p-cumenyl-pyridazin-4-yl)oxybenzyl] ester cid_46846321
Type:
Small organic molecule
Emp. Form.:
C22H21ClN2O4
Mol. Mass.:
412.866
SMILES:
CC(C)c1ccc(cc1)-n1ncc(Cl)c(Oc2ccc(COC(C)=O)cc2)c1=O
: