Target
Neuropeptides B/W receptor type 1
Ligand
BDBM75916
Substrate
Meas. Tech.
Late-stage fluorescence-based dose response cell-based screening assay to identify antagonists of the G-protein coupled receptor 7 (GPR7)
IC50
1700±n/a nM
Citation
 PubChem, PC Late-stage fluorescence-based dose response cell-based screening assay to identify antagonists of the G-protein coupled receptor 7 (GPR7) PubChem Bioassay (2010)[AID] 
Target
Name:
Neuropeptides B/W receptor type 1
Synonyms:
GPR7 NPBWR1 | neuropeptides B/W receptor 1
Type:
Enzyme Catalytic Domain
Mol. Mass.:
36111.82
Organism:
Homo sapiens (Human)
Description:
gi_119607128
Residue:
328
  
Inhibitor
Name:
BDBM75916
Synonyms:
5-chloranyl-4-(4-methoxyphenoxy)-2-[(4-methylphenyl)methyl]pyridazin-3-one 5-chloro-4-(4-methoxyphenoxy)-2-[(4-methylphenyl)methyl]-3-pyridazinone SR-02000000446 cid_46835816
Type:
Small organic molecule
Emp. Form.:
C19H17ClN2O3
Mol. Mass.:
356.803
SMILES:
COc1ccc(Oc2c(Cl)cnn(Cc3ccc(C)cc3)c2=O)cc1
: