Target
Photoreceptor-specific nuclear receptor
Ligand
BDBM75960
Substrate
Meas. Tech.
TR-FRET-based biochemical high throughput dose response assay to identify NR2E3 inverse agonists
IC50
5517±n/a nM
Citation
 PubChem, PC TR-FRET-based biochemical high throughput dose response assay to identify NR2E3 inverse agonists PubChem Bioassay (2010)[AID] 
Target
Name:
Photoreceptor-specific nuclear receptor
Synonyms:
NR2E3 PNR photoreceptor-specific nuclear receptor
Type:
PROTEIN
Mol. Mass.:
44699.83
Organism:
Homo sapiens (Human)
Description:
ChEMBL_401901
Residue:
410
  
Inhibitor
Name:
BDBM75960
Synonyms:
MLS000048874 N-phenyl-2-[(4-phenyl-5-thiophen-2-yl-1,2,4-triazol-3-yl)sulfanyl]ethanamide N-phenyl-2-[[4-phenyl-5-(2-thienyl)-1,2,4-triazol-3-yl]thio]acetamide cid_2357568
Type:
Small organic molecule
Emp. Form.:
C20H16N4OS2
Mol. Mass.:
392.497
SMILES:
O=C(CSc1nnc(-c2cccs2)n1-c1ccccc1)Nc1ccccc1
: