Target
Photoreceptor-specific nuclear receptor
Ligand
BDBM67838
Substrate
Meas. Tech.
TR-FRET-based biochemical high throughput dose response assay to identify NR2E3 inverse agonists
IC50
473.9±n/a nM
Citation
 PubChem, PC TR-FRET-based biochemical high throughput dose response assay to identify NR2E3 inverse agonists PubChem Bioassay (2010)[AID] 
Target
Name:
Photoreceptor-specific nuclear receptor
Synonyms:
NR2E3 PNR photoreceptor-specific nuclear receptor
Type:
PROTEIN
Mol. Mass.:
44699.83
Organism:
Homo sapiens (Human)
Description:
ChEMBL_401901
Residue:
410
  
Inhibitor
Name:
BDBM67838
Synonyms:
2-[[2-[2-(3,5-dimethyl-1H-pyrazol-4-yl)ethyl]-[1,2,4]triazolo[1,5-c]quinazolin-5-yl]sulfanyl]-N-(3-fluoranyl-4-methyl-phenyl)ethanamide 2-[[2-[2-(3,5-dimethyl-1H-pyrazol-4-yl)ethyl]-[1,2,4]triazolo[1,5-c]quinazolin-5-yl]thio]-N-(3-fluoro-4-methyl-phenyl)acetamide MLS000520733 cid_4640649
Type:
Small organic molecule
Emp. Form.:
C25H24FN7OS
Mol. Mass.:
489.568
SMILES:
Cc1n[nH]c(C)c1CCc1nc2c3ccccc3nc(SCC(=O)Nc3ccc(C)c(F)c3)n2n1
: