Target
Photoreceptor-specific nuclear receptor
Ligand
BDBM75970
Substrate
Meas. Tech.
TR-FRET-based biochemical high throughput dose response assay to identify NR2E3 inverse agonists
IC50
12746±n/a nM
Citation
 PubChem, PC TR-FRET-based biochemical high throughput dose response assay to identify NR2E3 inverse agonists PubChem Bioassay (2010)[AID] 
Target
Name:
Photoreceptor-specific nuclear receptor
Synonyms:
NR2E3 PNR photoreceptor-specific nuclear receptor
Type:
PROTEIN
Mol. Mass.:
44699.83
Organism:
Homo sapiens (Human)
Description:
ChEMBL_401901
Residue:
410
  
Inhibitor
Name:
BDBM75970
Synonyms:
3-chloranyl-6-methyl-N-(5-methyl-1,2-oxazol-3-yl)-1-benzothiophene-2-carboxamide 3-chloro-6-methyl-N-(5-methyl-3-isoxazolyl)-1-benzothiophene-2-carboxamide MLS000535628 cid_887251
Type:
Small organic molecule
Emp. Form.:
C14H11ClN2O2S
Mol. Mass.:
306.767
SMILES:
Cc1cc(NC(=O)c2sc3cc(C)ccc3c2Cl)no1
: