Target
Photoreceptor-specific nuclear receptor
Ligand
BDBM75990
Substrate
Meas. Tech.
TR-FRET-based biochemical high throughput dose response assay to identify NR2E3 inverse agonists
IC50
1613±n/a nM
Citation
 PubChem, PC TR-FRET-based biochemical high throughput dose response assay to identify NR2E3 inverse agonists PubChem Bioassay (2010)[AID] 
Target
Name:
Photoreceptor-specific nuclear receptor
Synonyms:
NR2E3 PNR photoreceptor-specific nuclear receptor
Type:
PROTEIN
Mol. Mass.:
44699.83
Organism:
Homo sapiens (Human)
Description:
ChEMBL_401901
Residue:
410
  
Inhibitor
Name:
BDBM75990
Synonyms:
MLS000765462 N-[2-(3-pyridinyl)-1,3-benzoxazol-5-yl]-2,3-dihydro-1,4-benzodioxin-6-carboxamide SMR000289567 | cid_1160074
Type:
Small organic molecule
Emp. Form.:
C21H15N3O4
Mol. Mass.:
373.3615
SMILES:
O=C(Nc1ccc2oc(nc2c1)-c1cccnc1)c1ccc2OCCOc2c1
: