Target
Isoform 2 of Nuclear receptor corepressor 2 (TRAC-1)
Ligand
BDBM39727
Substrate
Meas. Tech.
Counterscreen for NR2E3 inverse agonists
IC50
5817±n/a nM
Citation
 PubChem, PC Counterscreen for NR2E3 inverse agonists: TR-FRET-based biochemical high throughput dose response assay to identify inverse agonists of the interaction between peroxisome proliferator-activated receptor gamma (PPARg) and nuclear receptor co-repressor 2 (NCOR2) PubChem Bioassay (2010)[AID] 
Target
Name:
Isoform 2 of Nuclear receptor corepressor 2 (TRAC-1)
Synonyms:
CTG26 NCOR2_HUMAN nuclear receptor corepressor 2 isoform 2
Type:
Enzyme Catalytic Domain
Mol. Mass.:
81401.89
Organism:
Homo sapiens (Human)
Description:
Q9Y618-2 gi_116256445
Residue:
766
  
Inhibitor
Name:
BDBM39727
Synonyms:
2-(2-naphthalenyloxy)-N-[2-[[2-(2-naphthalenyloxy)-1-oxoethyl]amino]ethyl]acetamide 2-naphthalen-2-yloxy-N-[2-(2-naphthalen-2-yloxyethanoylamino)ethyl]ethanamide MLS000534009 SMR000141445 | cid_1787421
Type:
Small organic molecule
Emp. Form.:
C26H24N2O4
Mol. Mass.:
428.4798
SMILES:
O=C(COc1ccc2ccccc2c1)NCCNC(=O)COc1ccc2ccccc2c1
: