Target
Isoform 2 of Nuclear receptor corepressor 2 (TRAC-1)
Ligand
BDBM75976
Substrate
Meas. Tech.
Counterscreen for NR2E3 inverse agonists
IC50
7420±n/a nM
Citation
 PubChem, PC Counterscreen for NR2E3 inverse agonists: TR-FRET-based biochemical high throughput dose response assay to identify inverse agonists of the interaction between peroxisome proliferator-activated receptor gamma (PPARg) and nuclear receptor co-repressor 2 (NCOR2) PubChem Bioassay (2010)[AID] 
Target
Name:
Isoform 2 of Nuclear receptor corepressor 2 (TRAC-1)
Synonyms:
CTG26 NCOR2_HUMAN nuclear receptor corepressor 2 isoform 2
Type:
Enzyme Catalytic Domain
Mol. Mass.:
81401.89
Organism:
Homo sapiens (Human)
Description:
Q9Y618-2 gi_116256445
Residue:
766
  
Inhibitor
Name:
BDBM75976
Synonyms:
3-(4-methoxyphenyl)-2-[4-methoxy-3-(pyridin-2-ylsulfanylmethyl)phenyl]-1,2-dihydroquinazolin-4-one 3-(4-methoxyphenyl)-2-[4-methoxy-3-[(2-pyridylthio)methyl]phenyl]-1,2-dihydroquinazolin-4-one MLS000572432 cid_2888544
Type:
Small organic molecule
Emp. Form.:
C28H25N3O3S
Mol. Mass.:
483.581
SMILES:
COc1ccc(cc1)N1C(Nc2ccccc2C1=O)c1ccc(OC)c(CSc2ccccn2)c1
: