Target
Isoform 2 of Nuclear receptor corepressor 2 (TRAC-1)
Ligand
BDBM75988
Substrate
Meas. Tech.
Counterscreen for NR2E3 inverse agonists
IC50
3501±n/a nM
Citation
 PubChem, PC Counterscreen for NR2E3 inverse agonists: TR-FRET-based biochemical high throughput dose response assay to identify inverse agonists of the interaction between peroxisome proliferator-activated receptor gamma (PPARg) and nuclear receptor co-repressor 2 (NCOR2) PubChem Bioassay (2010)[AID] 
Target
Name:
Isoform 2 of Nuclear receptor corepressor 2 (TRAC-1)
Synonyms:
CTG26 NCOR2_HUMAN nuclear receptor corepressor 2 isoform 2
Type:
Enzyme Catalytic Domain
Mol. Mass.:
81401.89
Organism:
Homo sapiens (Human)
Description:
Q9Y618-2 gi_116256445
Residue:
766
  
Inhibitor
Name:
BDBM75988
Synonyms:
4-(4-chloranylphenoxy)-N-(5-ethanoyl-4-methyl-1,3-thiazol-2-yl)butanamide N-(5-acetyl-4-methyl-1,3-thiazol-2-yl)-4-(4-chlorophenoxy)butanamide N-(5-acetyl-4-methyl-thiazol-2-yl)-4-(4-chlorophenoxy)butyramide cid_1637692
Type:
Small organic molecule
Emp. Form.:
C16H17ClN2O3S
Mol. Mass.:
352.836
SMILES:
CC(=O)c1sc(NC(=O)CCCOc2ccc(Cl)cc2)nc1C
: