Target
Isoform 2 of Nuclear receptor corepressor 2 (TRAC-1)
Ligand
BDBM75998
Substrate
Meas. Tech.
Counterscreen for NR2E3 inverse agonists
IC50
8589±n/a nM
Citation
 PubChem, PC Counterscreen for NR2E3 inverse agonists: TR-FRET-based biochemical high throughput dose response assay to identify inverse agonists of the interaction between peroxisome proliferator-activated receptor gamma (PPARg) and nuclear receptor co-repressor 2 (NCOR2) PubChem Bioassay (2010)[AID] 
Target
Name:
Isoform 2 of Nuclear receptor corepressor 2 (TRAC-1)
Synonyms:
CTG26 NCOR2_HUMAN nuclear receptor corepressor 2 isoform 2
Type:
Enzyme Catalytic Domain
Mol. Mass.:
81401.89
Organism:
Homo sapiens (Human)
Description:
Q9Y618-2 gi_116256445
Residue:
766
  
Inhibitor
Name:
BDBM75998
Synonyms:
MLS000689386 N-(4-chlorophenyl)-4-methyl-3,4-dihydro-2H-1,4-benzothiazine-6-carboxamide cid_5082268
Type:
Small organic molecule
Emp. Form.:
C16H15ClN2OS
Mol. Mass.:
318.821
SMILES:
CN1CCSc2ccc(cc12)C(=O)Nc1ccc(Cl)cc1
: