Target
Isoform 2 of Nuclear receptor corepressor 2 (TRAC-1)
Ligand
BDBM53225
Substrate
Meas. Tech.
Counterscreen for NR2E3 inverse agonists
IC50
4930±n/a nM
Citation
 PubChem, PC Counterscreen for NR2E3 inverse agonists: TR-FRET-based biochemical high throughput dose response assay to identify inverse agonists of the interaction between peroxisome proliferator-activated receptor gamma (PPARg) and nuclear receptor co-repressor 2 (NCOR2) PubChem Bioassay (2010)[AID] 
Target
Name:
Isoform 2 of Nuclear receptor corepressor 2 (TRAC-1)
Synonyms:
CTG26 NCOR2_HUMAN nuclear receptor corepressor 2 isoform 2
Type:
Enzyme Catalytic Domain
Mol. Mass.:
81401.89
Organism:
Homo sapiens (Human)
Description:
Q9Y618-2 gi_116256445
Residue:
766
  
Inhibitor
Name:
BDBM53225
Synonyms:
2-[(4-acetylbenzoyl)amino]-6-benzyl-5,7-dihydro-4H-thieno[2,3-c]pyridine-3-carboxamide;hydrochloride 2-[[(4-acetylphenyl)-oxomethyl]amino]-6-(phenylmethyl)-5,7-dihydro-4H-thieno[2,3-c]pyridine-3-carboxamide;hydrochloride SMR000640804 | cid_16806307
Type:
Small organic molecule
Emp. Form.:
C24H23N3O3S
Mol. Mass.:
433.523
SMILES:
CC(=O)c1ccc(cc1)C(=O)Nc1sc2CN(Cc3ccccc3)CCc2c1C(N)=O
: