Target
Isoform 2 of Nuclear receptor corepressor 2 (TRAC-1)
Ligand
BDBM76015
Substrate
Meas. Tech.
Counterscreen for NR2E3 inverse agonists
IC50
2861±n/a nM
Citation
 PubChem, PC Counterscreen for NR2E3 inverse agonists: TR-FRET-based biochemical high throughput dose response assay to identify inverse agonists of the interaction between peroxisome proliferator-activated receptor gamma (PPARg) and nuclear receptor co-repressor 2 (NCOR2) PubChem Bioassay (2010)[AID] 
Target
Name:
Isoform 2 of Nuclear receptor corepressor 2 (TRAC-1)
Synonyms:
CTG26 NCOR2_HUMAN nuclear receptor corepressor 2 isoform 2
Type:
Enzyme Catalytic Domain
Mol. Mass.:
81401.89
Organism:
Homo sapiens (Human)
Description:
Q9Y618-2 gi_116256445
Residue:
766
  
Inhibitor
Name:
BDBM76015
Synonyms:
3-Methoxy-naphthalene-2-carboxylic acid (2-oxo-2H-chromen-6-yl)-amide 3-methoxy-N-(2-oxo-1-benzopyran-6-yl)-2-naphthalenecarboxamide MLS001219448 SMR000612701 | cid_965782
Type:
Small organic molecule
Emp. Form.:
C21H15NO4
Mol. Mass.:
345.3481
SMILES:
COc1cc2ccccc2cc1C(=O)Nc1ccc2oc(=O)ccc2c1
: