Target
Apelin receptor
Ligand
BDBM269525
Substrate
Meas. Tech.
[35S]GTPgammaS Binding Assay
pH
7.5±n/a
EC50
51.0±n/a nM
Comments
extracted
Citation
 Chen, NChen, XChen, YFu, ZHeath, JAHorne, DBKaller, MRKhakoo, AYKopecky, DJMa, ZMihalic, JTSwaminath, GWang, XYeh, W Methods of treating heart failure US Patent  US10058550 Publication Date 8/28/2018 
Target
Name:
Apelin receptor
Synonyms:
AGTRL1 APJ_HUMAN Angiotensin receptor-like 1 Apelin receptor (APJ) G-protein coupled receptor HG11
Type:
Enzyme Catalytic Domain
Mol. Mass.:
42664.06
Organism:
Homo sapiens (Human)
Description:
P35414
Residue:
380
  
Inhibitor
Name:
BDBM269525
Synonyms:
(1R,2S)-1-methoxy-N-(5-(6-methoxy-2-pyridinyl)-4-(4-pyridinyl)-4H-1,2,4-triazol-3-yl)-1-(5-methyl-2-pyrimidinyl)-2-propanesulfonamide US10221162, Example 42.0 | US9845310, Example 42.0
Type:
Small organic molecule
Emp. Form.:
C22H24N8O4S
Mol. Mass.:
496.542
SMILES:
CO[C@@H]([C@H](C)S(=O)(=O)Nc1nnc(-c2cccc(OC)n2)n1-c1ccncc1)c1ncc(C)cn1
: