Target
Apelin receptor
Ligand
BDBM269587
Substrate
Meas. Tech.
[35S]GTPgammaS Binding Assay
pH
7.5±n/a
EC50
7.00±n/a nM
Comments
extracted
Citation
 Chen, NChen, XChen, YFu, ZHeath, JAHorne, DBKaller, MRKhakoo, AYKopecky, DJMa, ZMihalic, JTSwaminath, GWang, XYeh, W Methods of treating heart failure US Patent  US10058550 Publication Date 8/28/2018 
Target
Name:
Apelin receptor
Synonyms:
AGTRL1 APJ_HUMAN Angiotensin receptor-like 1 Apelin receptor (APJ) G-protein coupled receptor HG11
Type:
Enzyme Catalytic Domain
Mol. Mass.:
42664.06
Organism:
Homo sapiens (Human)
Description:
P35414
Residue:
380
  
Inhibitor
Name:
BDBM269587
Synonyms:
(1R,2S)-N-(4-(2,6-dimethoxyphenyl)-5-(2-methoxy-4-pyridinyl)-4H-1,2,4-triazol-3-yl)-1-methoxy-1-(5-methyl-2-pyrimidinyl)-2-propanesulfonamide US10221162, Example 101.0 | US9845310, Example 101.0
Type:
Small organic molecule
Emp. Form.:
C25H29N7O6S
Mol. Mass.:
555.606
SMILES:
CO[C@@H]([C@H](C)S(=O)(=O)Nc1nnc(-c2ccnc(OC)c2)n1-c1c(OC)cccc1OC)c1ncc(C)cn1
: