Target
Apelin receptor
Ligand
BDBM269619
Substrate
Meas. Tech.
[35S]GTPgammaS Binding Assay
pH
7.5±n/a
EC50
36.0±n/a nM
Comments
extracted
Citation
 Chen, NChen, XChen, YFu, ZHeath, JAHorne, DBKaller, MRKhakoo, AYKopecky, DJMa, ZMihalic, JTSwaminath, GWang, XYeh, W Methods of treating heart failure US Patent  US10058550 Publication Date 8/28/2018 
Target
Name:
Apelin receptor
Synonyms:
AGTRL1 APJ_HUMAN Angiotensin receptor-like 1 Apelin receptor (APJ) G-protein coupled receptor HG11
Type:
Enzyme Catalytic Domain
Mol. Mass.:
42664.06
Organism:
Homo sapiens (Human)
Description:
P35414
Residue:
380
  
Inhibitor
Name:
BDBM269619
Synonyms:
(2S)-N-(4-(2,6-dimethoxyphenyl)-5-(2-methoxy-4-pyridinyl)-4H-1,2,4-triazol-3-yl)-1-(5-fluoro-2-pyrimidinyl)-2-propanesulfonamide, (2R)-N-(4-(2,6-dimethoxyphenyl)-5-(2-methoxy-4-pyridinyl)-4H-1,2,4-triazol-3-yl)-1-(5-fluoro-2-pyrimidinyl)-2-propanesulfonamide US10058550, Example 136.0 US9845310, Example 135.0
Type:
Small organic molecule
Emp. Form.:
C23H24FN7O5S
Mol. Mass.:
529.544
SMILES:
COc1cc(ccn1)-c1nnc(NS(=O)(=O)[C@@H](C)Cc2ncc(F)cn2)n1-c1c(OC)cccc1OC
: