Target
Apelin receptor
Ligand
BDBM269881
Substrate
Meas. Tech.
[35S]GTPgammaS Binding Assay
pH
7.5±n/a
EC50
25.0±n/a nM
Comments
extracted
Citation
 Chen, NChen, XChen, YFu, ZHeath, JAHorne, DBKaller, MRKhakoo, AYKopecky, DJMa, ZMihalic, JTSwaminath, GWang, XYeh, W Methods of treating heart failure US Patent  US10058550 Publication Date 8/28/2018 
Target
Name:
Apelin receptor
Synonyms:
AGTRL1 APJ_HUMAN Angiotensin receptor-like 1 Apelin receptor (APJ) G-protein coupled receptor HG11
Type:
Enzyme Catalytic Domain
Mol. Mass.:
42664.06
Organism:
Homo sapiens (Human)
Description:
P35414
Residue:
380
  
Inhibitor
Name:
BDBM269881
Synonyms:
(1S,2S)—N-(4-(2,6-dimethoxyphenyl)-5-(5-methylpyridin-3-yl)-4H-1,2,4-triazol-3-yl)-1-(2-hydroxy-2-methylpropoxy)-1-(5-methylpyrimidin-2-yl)propane-2-sulfonamide or (1R,2R)—N-(4-(2,6-dimethoxyphenyl)-5-(5-methylpyridin-3-yl)-4H-1,2,4-triazol-3-yl)-1-(2-hydroxy-2-methylpropoxy)-1-(5-methylpyrimidin-2-yl)propane-2-sulfonamide US10058550, Example 412.0 US9845310, Example 412.0
Type:
Small organic molecule
Emp. Form.:
C28H35N7O6S
Mol. Mass.:
597.686
SMILES:
COc1cccc(OC)c1-n1c(NS(=O)(=O)[C@H](C)[C@H](OCC(C)(C)O)c2ncc(C)cn2)nnc1-c1cncc(C)c1
: