Target
Apelin receptor
Ligand
BDBM269883
Substrate
Meas. Tech.
[35S]GTPgammaS Binding Assay
pH
7.5±n/a
EC50
0.460±n/a nM
Comments
extracted
Citation
 Chen, NChen, XChen, YFu, ZHeath, JAHorne, DBKaller, MRKhakoo, AYKopecky, DJMa, ZMihalic, JTSwaminath, GWang, XYeh, W Methods of treating heart failure US Patent  US10058550 Publication Date 8/28/2018 
Target
Name:
Apelin receptor
Synonyms:
AGTRL1 APJ_HUMAN Angiotensin receptor-like 1 Apelin receptor (APJ) G-protein coupled receptor HG11
Type:
Enzyme Catalytic Domain
Mol. Mass.:
42664.06
Organism:
Homo sapiens (Human)
Description:
P35414
Residue:
380
  
Inhibitor
Name:
BDBM269883
Synonyms:
1S,2S)—N-(4-(2,6-dimethoxyphenyl)-5-(5-methylpyridin-3-yl)-4H-1,2,4-triazol-3-yl)-1-(2-methoxyethoxy)-1-(5-methylpyrimidin-2-yl)propane-2-sulfonamide or (1R,2R)—N-(4-(2,6-dimethoxyphenyl)-5-(5-methylpyridin-3-yl)-4H-1,2,4-triazol-3-yl)-1-(2-methoxyethoxy)-1-(5-methylpyrimidin-2-yl)propane-2-sulfonamide US10221162, Example 413.0 | US9845310, Example 413.0
Type:
Small organic molecule
Emp. Form.:
C27H33N7O6S
Mol. Mass.:
583.659
SMILES:
COCCO[C@H]([C@H](C)S(=O)(=O)Nc1nnc(-c2cncc(C)c2)n1-c1c(OC)cccc1OC)c1ncc(C)cn1
: