Target
Cannabinoid receptor 2
Ligand
BDBM76042
Substrate
Meas. Tech.
SAR analysis of agonists of the Cannabinoid Receptor 2 using an Image-Based Assay - Set 3
EC50
>32000±n/a nM
Citation
 PubChem, PC SAR analysis of agonists of the Cannabinoid Receptor 2 using an Image-Based Assay - Set 3 PubChem Bioassay (2010)[AID] 
Target
Name:
Cannabinoid receptor 2
Synonyms:
CANNABINOID CB2 CB2 CB2B CNR2_HUMAN Cannabinoid CB2 receptor Cannabinoid receptor 2 (CB2R) | hCB2
Type:
G Protein-Coupled Receptor (GPCR)
Mol. Mass.:
39690.94
Organism:
Homo sapiens (Human)
Description:
P34972
Residue:
360
  
Inhibitor
Name:
BDBM76042
Synonyms:
MLS-0437140.0001 [4-(2,7-dimethyl-5,6,7,8-tetrahydro-[1]benzothiolo[2,3-d]pyrimidin-4-yl)piperazin-1-yl]-pyridin-4-yl-methanone [4-(2,7-dimethyl-5,6,7,8-tetrahydrobenzothiopheno[2,3-d]pyrimidin-4-yl)piperazino]-(4-pyridyl)methanone | cid_46864267
Type:
Small organic molecule
Emp. Form.:
C22H25N5OS
Mol. Mass.:
407.532
SMILES:
CC1CCc2c(C1)sc1nc(C)nc(N3CCN(CC3)C(=O)c3ccncc3)c21
: