Target
Cannabinoid receptor 2
Ligand
BDBM76047
Substrate
Meas. Tech.
SAR analysis of agonists of the Cannabinoid Receptor 2 using an Image-Based Assay - Set 3
EC50
1310±n/a nM
Citation
 PubChem, PC SAR analysis of agonists of the Cannabinoid Receptor 2 using an Image-Based Assay - Set 3 PubChem Bioassay (2010)[AID] 
Target
Name:
Cannabinoid receptor 2
Synonyms:
CANNABINOID CB2 CB2 CB2B CNR2_HUMAN Cannabinoid CB2 receptor Cannabinoid receptor 2 (CB2R) | hCB2
Type:
G Protein-Coupled Receptor (GPCR)
Mol. Mass.:
39690.94
Organism:
Homo sapiens (Human)
Description:
P34972
Residue:
360
  
Inhibitor
Name:
BDBM76047
Synonyms:
1-cyclopentyl-2-imino-5-oxo-N-(phenylmethyl)-3-dipyrido[1,2-d:3',4'-f]pyrimidinecarboxamide MLS-0437144.0001 N-benzyl-1-cyclopentyl-2-imino-5-oxodipyrido[1,2-d:3',4'-f]pyrimidine-3-carboxamide | cid_1077539
Type:
Small organic molecule
Emp. Form.:
C24H23N5O2
Mol. Mass.:
413.4717
SMILES:
N=c1c(cc2c(nc3ccccn3c2=O)n1C1CCCC1)C(=O)NCc1ccccc1
: