Target
Cannabinoid receptor 2
Ligand
BDBM76063
Substrate
Meas. Tech.
SAR analysis of agonists of the Cannabinoid Receptor 2 using an Image-Based Assay - Set 3
EC50
>32000±n/a nM
Citation
 PubChem, PC SAR analysis of agonists of the Cannabinoid Receptor 2 using an Image-Based Assay - Set 3 PubChem Bioassay (2010)[AID] 
Target
Name:
Cannabinoid receptor 2
Synonyms:
CANNABINOID CB2 CB2 CB2B CNR2_HUMAN Cannabinoid CB2 receptor Cannabinoid receptor 2 (CB2R) | hCB2
Type:
G Protein-Coupled Receptor (GPCR)
Mol. Mass.:
39690.94
Organism:
Homo sapiens (Human)
Description:
P34972
Residue:
360
  
Inhibitor
Name:
BDBM76063
Synonyms:
7-methyl-2-(4-methylphenyl)-4-phenyl-pyrazolo[3,4-d]pyridazine 7-methyl-4-phenyl-2-(p-tolyl)pyrazolo[3,4-d]pyridazine cid_15359842
Type:
Small organic molecule
Emp. Form.:
C19H16N4
Mol. Mass.:
300.3571
SMILES:
Cc1ccc(cc1)-n1cc2c(nnc(C)c2n1)-c1ccccc1
: