Target
Cannabinoid receptor 2
Ligand
BDBM50683
Substrate
Meas. Tech.
SAR analysis of agonists of the Cannabinoid Receptor 2 using an Image-Based Assay - Set 3
EC50
>32000±n/a nM
Citation
 PubChem, PC SAR analysis of agonists of the Cannabinoid Receptor 2 using an Image-Based Assay - Set 3 PubChem Bioassay (2010)[AID] 
Target
Name:
Cannabinoid receptor 2
Synonyms:
CANNABINOID CB2 CB2 CB2B CNR2_HUMAN Cannabinoid CB2 receptor Cannabinoid receptor 2 (CB2R) | hCB2
Type:
G Protein-Coupled Receptor (GPCR)
Mol. Mass.:
39690.94
Organism:
Homo sapiens (Human)
Description:
P34972
Residue:
360
  
Inhibitor
Name:
BDBM50683
Synonyms:
2-(4-pyridyl)-N-[4-(thiazol-2-ylsulfamoyl)phenyl]cinchoninamide 2-pyridin-4-yl-N-[4-(2-thiazolylsulfamoyl)phenyl]-4-quinolinecarboxamide SMR000369889 | cid_2385808
Type:
Small organic molecule
Emp. Form.:
C24H17N5O3S2
Mol. Mass.:
487.553
SMILES:
O=C(Nc1ccc(cc1)S(=O)(=O)Nc1nccs1)c1cc(nc2ccccc12)-c1ccncc1
: