Target
Cannabinoid receptor 2
Ligand
BDBM76061
Substrate
Meas. Tech.
SAR analysis of antagonists of the Cannabinoid Receptor 2 using an Image-Based Assay - Set 3
IC50
19500±n/a nM
Citation
 PubChem, PC SAR analysis of antagonists of the Cannabinoid Receptor 2 using an Image-Based Assay - Set 3 PubChem Bioassay (2010)[AID] 
Target
Name:
Cannabinoid receptor 2
Synonyms:
CANNABINOID CB2 CB2 CB2B CNR2_HUMAN Cannabinoid CB2 receptor Cannabinoid receptor 2 (CB2R) | hCB2
Type:
G Protein-Coupled Receptor (GPCR)
Mol. Mass.:
39690.94
Organism:
Homo sapiens (Human)
Description:
P34972
Residue:
360
  
Inhibitor
Name:
BDBM76061
Synonyms:
4-(4-chlorophenyl)-7-methyl-2-phenyl-pyrazolo[3,4-d]pyridazine MLS-0437167.0001 | cid_5143845
Type:
Small organic molecule
Emp. Form.:
C18H13ClN4
Mol. Mass.:
320.776
SMILES:
Cc1nnc(-c2ccc(Cl)cc2)c2cn(nc12)-c1ccccc1
: