Target
G-protein coupled receptor 35
Ligand
BDBM57190
Substrate
Meas. Tech.
SAR analysis of Antagonists of the GPR35 Receptor using an Image-Based Assay - Set 6
IC50
>32000±n/a nM
Citation
 PubChem, PC SAR analysis of Antagonists of the GPR35 Receptor using an Image-Based Assay - Set 6 PubChem Bioassay (2010)[AID] 
Target
Name:
G-protein coupled receptor 35
Synonyms:
G protein-coupled receptor 35 GPR35_HUMAN
Type:
Enzyme Catalytic Domain
Mol. Mass.:
34085.57
Organism:
Homo sapiens (Human)
Description:
gi_33695097
Residue:
309
  
Inhibitor
Name:
BDBM57190
Synonyms:
(6Z)-6-[4-(4-chlorophenyl)-5-methyl-1,2-dihydropyrazol-3-ylidene]-3-methoxy-1-cyclohexa-2,4-dienone (6Z)-6-[4-(4-chlorophenyl)-5-methyl-1,2-dihydropyrazol-3-ylidene]-3-methoxycyclohexa-2,4-dien-1-one 2-[4-(4-Chloro-phenyl)-5-methyl-1H-pyrazol-3-yl]-5-methoxy-phenol SMR000145663 | cid_5423869
Type:
Small organic molecule
Emp. Form.:
C17H15ClN2O2
Mol. Mass.:
314.766
SMILES:
COc1ccc(-c2n[nH]c(C)c2-c2ccc(Cl)cc2)c(O)c1
: