Target
G-protein coupled receptor 35
Ligand
BDBM76040
Substrate
Meas. Tech.
SAR analysis of Agonists of the GPR35 Receptor using an Image-Based Assay - Set 4
EC50
>32000±n/a nM
Citation
 PubChem, PC SAR analysis of Agonists of the GPR35 Receptor using an Image-Based Assay - Set 4 PubChem Bioassay (2010)[AID] 
Target
Name:
G-protein coupled receptor 35
Synonyms:
G protein-coupled receptor 35 GPR35_HUMAN
Type:
Enzyme Catalytic Domain
Mol. Mass.:
34085.57
Organism:
Homo sapiens (Human)
Description:
gi_33695097
Residue:
309
  
Inhibitor
Name:
BDBM76040
Synonyms:
(1,2-dimethyl-5-benzimidazolyl)-[4-(2,7-dimethyl-5,6,7,8-tetrahydro-[1]benzothiolo[2,3-d]pyrimidin-4-yl)-1-piperazinyl]methanone (1,2-dimethylbenzimidazol-5-yl)-[4-(2,7-dimethyl-5,6,7,8-tetrahydrobenzothiopheno[2,3-d]pyrimidin-4-yl)piperazino]methanone cid_3197465
Type:
Small organic molecule
Emp. Form.:
C26H30N6OS
Mol. Mass.:
474.621
SMILES:
CC1CCc2c(C1)sc1nc(C)nc(N3CCN(CC3)C(=O)c3ccc4n(C)c(C)nc4c3)c21
: