Target
Large T antigen
Ligand
BDBM36880
Substrate
Meas. Tech.
A confirmatory biochemical assay using the ADP-Hunter methodology, purified TAg, and ATP to quantify activity of synthesized compounds that inhibit the ATPase activity of Tag (3)
IC50
35700±n/a nM
Citation
 PubChem, PC A confirmatory biochemical assay using the ADP-Hunter methodology, purified TAg, and ATP to quantify activity of synthesized compounds that inhibit the ATPase activity of Tag (3) PubChem Bioassay (2010)[AID] 
Target
Name:
Large T antigen
Synonyms:
LT LT_SV40
Type:
Enzyme Catalytic Domain
Mol. Mass.:
81575.54
Organism:
Simian virus 40
Description:
P03070
Residue:
708
  
Inhibitor
Name:
BDBM36880
Synonyms:
2,2'-THIOBIS(4,6-DICHLOROPHENOL) 2,4-dichloro-6-[(3,5-dichloro-2-hydroxy-phenyl)thio]phenol 2-[3,5-bis(chloranyl)-2-oxidanyl-phenyl]sulfanyl-4,6-bis(chloranyl)phenol HL-3 SMR000058374 | cid_2406
Type:
Small organic molecule
Emp. Form.:
C12H6Cl4O2S
Mol. Mass.:
356.052
SMILES:
Oc1c(Cl)cc(Cl)cc1Sc1cc(Cl)cc(Cl)c1O
: