Target
Apelin receptor
Ligand
BDBM50895
Substrate
Meas. Tech.
Dose Response confirmation of uHTS hits from a small molecule agonists of the APJ receptor via a luminescent beta-arrestin assay
EC50
>100000±n/a nM
Citation
 PubChem, PC Dose Response confirmation of uHTS hits from a small molecule agonists of the APJ receptor via a luminescent beta-arrestin assay PubChem Bioassay (2010)[AID] 
Target
Name:
Apelin receptor
Synonyms:
AGTRL1 APJ_HUMAN Angiotensin receptor-like 1 Apelin receptor (APJ) G-protein coupled receptor HG11
Type:
Enzyme Catalytic Domain
Mol. Mass.:
42664.06
Organism:
Homo sapiens (Human)
Description:
P35414
Residue:
380
  
Inhibitor
Name:
BDBM50895
Synonyms:
(4Z)-4-[[5-(2,5-dichlorophenyl)-2-furanyl]methylidene]-3-methyl-5-isoxazolone (4Z)-4-[[5-(2,5-dichlorophenyl)furan-2-yl]methylidene]-3-methyl-1,2-oxazol-5-one 4-{[5-(2,5-dichlorophenyl)-2-furyl]methylene}-3-methyl-5(4H)-isoxazolone SMR000141784 | cid_5733602
Type:
Small organic molecule
Emp. Form.:
C15H9Cl2NO3
Mol. Mass.:
322.143
SMILES:
CC1=NOC(=O)\C1=C/c1ccc(o1)-c1cc(Cl)ccc1Cl
: