Target
Apelin receptor
Ligand
BDBM8551
Substrate
Meas. Tech.
Dose Response confirmation of uHTS hits from a small molecule agonists of the APJ receptor via a luminescent beta-arrestin assay
EC50
>100000±n/a nM
Citation
 PubChem, PC Dose Response confirmation of uHTS hits from a small molecule agonists of the APJ receptor via a luminescent beta-arrestin assay PubChem Bioassay (2010)[AID] 
Target
Name:
Apelin receptor
Synonyms:
AGTRL1 APJ_HUMAN Angiotensin receptor-like 1 Apelin receptor (APJ) G-protein coupled receptor HG11
Type:
Enzyme Catalytic Domain
Mol. Mass.:
42664.06
Organism:
Homo sapiens (Human)
Description:
P35414
Residue:
380
  
Inhibitor
Name:
BDBM8551
Synonyms:
2-{[(2-chlorophenyl)methyl]sulfanyl}-5-(pyridin-4-yl)-1,3,4-oxadiazole oxadiazole-pyridyl containing compound 11
Type:
Small organic molecule
Emp. Form.:
C14H10ClN3OS
Mol. Mass.:
303.767
SMILES:
Clc1ccccc1CSc1nnc(o1)-c1ccncc1
: