Target
Apelin receptor
Ligand
BDBM76134
Substrate
Meas. Tech.
Dose Response confirmation of uHTS hits from a small molecule agonists of the APJ receptor via a luminescent beta-arrestin assay
EC50
>100000±n/a nM
Citation
 PubChem, PC Dose Response confirmation of uHTS hits from a small molecule agonists of the APJ receptor via a luminescent beta-arrestin assay PubChem Bioassay (2010)[AID] 
Target
Name:
Apelin receptor
Synonyms:
AGTRL1 APJ_HUMAN Angiotensin receptor-like 1 Apelin receptor (APJ) G-protein coupled receptor HG11
Type:
Enzyme Catalytic Domain
Mol. Mass.:
42664.06
Organism:
Homo sapiens (Human)
Description:
P35414
Residue:
380
  
Inhibitor
Name:
BDBM76134
Synonyms:
4-(6,7-diethoxy-4-keto-2-thioxo-1H-quinazolin-3-yl)-N-(2-pyridylmethyl)butyramide 4-(6,7-diethoxy-4-oxo-2-sulfanylidene-1H-quinazolin-3-yl)-N-(2-pyridinylmethyl)butanamide MLS001029364 cid_4339959
Type:
Small organic molecule
Emp. Form.:
C22H26N4O4S
Mol. Mass.:
442.531
SMILES:
CCOc1cc2[nH]c(=S)n(CCCC(=O)NCc3ccccn3)c(=O)c2cc1OCC
: