Target
Apelin receptor
Ligand
BDBM64465
Substrate
Meas. Tech.
Dose Response confirmation of uHTS hits from a small molecule agonists of the APJ receptor via a luminescent beta-arrestin assay
EC50
>100000±n/a nM
Citation
 PubChem, PC Dose Response confirmation of uHTS hits from a small molecule agonists of the APJ receptor via a luminescent beta-arrestin assay PubChem Bioassay (2010)[AID] 
Target
Name:
Apelin receptor
Synonyms:
AGTRL1 APJ_HUMAN Angiotensin receptor-like 1 Apelin receptor (APJ) G-protein coupled receptor HG11
Type:
Enzyme Catalytic Domain
Mol. Mass.:
42664.06
Organism:
Homo sapiens (Human)
Description:
P35414
Residue:
380
  
Inhibitor
Name:
BDBM64465
Synonyms:
4-(3,4-dihydro-1H-isoquinolin-2-ylsulfonyl)-N-(4,7-dimethoxy-1,3-benzothiazol-2-yl)-N-[3-(dimethylamino)propyl]benzamide;hydrochloride SMR000807899 | cid_24892212
Type:
Small organic molecule
Emp. Form.:
C30H34N4O5S2
Mol. Mass.:
594.745
SMILES:
COc1ccc(OC)c2sc(nc12)N(CCCN(C)C)C(=O)c1ccc(cc1)S(=O)(=O)N1CCc2ccccc2C1
: